﻿"Dublin Core:Title","Dublin Core:Subject","Dublin Core:Description","Dublin Core:Creator","Dublin Core:Source","Dublin Core:Publisher","Dublin Core:Date","Dublin Core:Contributor","Dublin Core:Rights","Dublin Core:Relation","Dublin Core:Format","Dublin Core:Language","Dublin Core:Type","Dublin Core:Identifier","Dublin Core:Coverage","Item Type Metadata:Text","Item Type Metadata:Interviewer","Item Type Metadata:Interviewee","Item Type Metadata:Location","Item Type Metadata:Transcription","Item Type Metadata:Local URL","Item Type Metadata:Original Format","Item Type Metadata:Physical Dimensions","Item Type Metadata:Duration","Item Type Metadata:Compression","Item Type Metadata:Producer","Item Type Metadata:Director","Item Type Metadata:Bit Rate/Frequency","Item Type Metadata:Time Summary","Item Type Metadata:Email Body","Item Type Metadata:Subject Line","Item Type Metadata:From","Item Type Metadata:To","Item Type Metadata:CC","Item Type Metadata:BCC","Item Type Metadata:Number of Attachments","Item Type Metadata:Standards","Item Type Metadata:Objectives","Item Type Metadata:Materials","Item Type Metadata:Lesson Plan Text","Item Type Metadata:URL","Item Type Metadata:Event Type","Item Type Metadata:Participants","Item Type Metadata:Birth Date","Item Type Metadata:Birthplace","Item Type Metadata:Death Date","Item Type Metadata:Occupation","Item Type Metadata:Biographical Text","Item Type Metadata:Bibliography",tags,file,itemType,collection,public,featured
"[Page de titre]",,,,,,,,,,Vignette,,"Gravure sur bois",RES_16P_009-1_001_web,,,,,,,,,,,,,,,,,,,,,,,,,,,,,,,,,,,,"Colonne,Enseignement,Livre",https://hieronyma.ict-toulouse.fr/files/original/81c2cc0a66895832900a4e1f6396be65.jpg,"Image fixe","Decisiones Capelle Tholose",1,1
"[Judith en prière]",,,,,,,,,,Vignette,,"Gravure sur bois",PAT_16M_022_245_web,,,,,,,,,,,,,,,,,,,,,,,,,,,,,,,,,,,,"Agenouillé,Autel,Chambre,Intérieur,Judith,Lit,Livre,Livre de Judith,Prière,Serviteur",https://hieronyma.ict-toulouse.fr/files/original/367bb9fc5b2de763ef4d55bf56189bab.JPG,"Image fixe","[Bible, latin, 1574]",1,0
"[Début du Livre d'Isaïe : Portrait d'Isaïe]",,,,,,,,,,Vignette,,"Gravure sur bois",PAT_16M_022_258_web,,,,,,,,,,,,,,,,,,,,,,,,,,,,,,,,,,,,"Assis,Grand prophète,Isaïe,Livre,Livre d'Isaïe,Phylactère",https://hieronyma.ict-toulouse.fr/files/original/34dddaaa559aefc37bbc91d7c6f3a789.jpg,"Image fixe","[Bible, latin, 1574]",1,0
"[Saint Jérôme de Stridon]",,,,,,,,,,Vignette,,"Gravure sur bois",PAT_18P_338_001_web,,,,,,,,,,,,,,,,,,,,,,,,,,,,,,,,,,,,"Chapeau,Crucifix,Intérieur,Lion,Livre,Prière,Saint Jérôme de Stridon,Savignac",https://hieronyma.ict-toulouse.fr/files/original/f42697d49ae3aa9fc564819750c387a9.jpg,"Image fixe","Nouveau livre d'Église à l'usage de Rome",1,1
"[Bandeau : allégorie de l'Église]",,,,,,,,,,"Ornement typographique",,"Gravure sur bois",PAT_18P_339_002_web,,,,,,,,,,,,,,,,,,,,,,,,,,,,,,,,,,,,"Allégorie,Croix,Église,Encensoir,L'Europe ecclésiastique,Livre,Savignac",https://hieronyma.ict-toulouse.fr/files/original/f297e0b7de75417e3edcbae807266bae.JPG,"Image fixe","L'Europe ecclésiastique",1,0
"Art d'Ecrire",,,,,,,,,,"Image pleine page",,"Gravure sur cuivre",ENC_1783_PAN_000_web,,,,,,,,,,,,,,,,,,,,,,,,,,,,,,,,,,,,"Assis,Écriture,Encrier,Fauteuil,Feuillet,Homme,Instrument d'écriture,Intérieur,JEP2019,Livre,Matériel d'écriture,Rouleau,Table",https://hieronyma.ict-toulouse.fr/files/original/ce5944c28a05c1f61c09dca6fbca0cf2.jpg,"Image fixe","Encyclopédie méthodique",1,1
"Le Symbole des Apostres",,,,,,,,,,"Image pleine page","français ; latin","Gravure sur cuivre",PAT_17P_618_018_web,,,,,,,,,,,,,,,,,,,,,,,,,,,,,,,,,,,,"Agenouillé,Ange,Bateau à voiles,Bâton,Christ,Clé,Couronne,Couronnement,Croix,Croix de Saint-André,Dieu le Père,Échelle,Enfant,Gobelet,Hache,Jacob,Les Apôtres,Livre,Louis XIII,Palme,Pèlerin,Prière,Saint André,Saint Barthélemy,Saint Jacques le Majeur,Saint Jacques le Mineur,Saint Jean,Saint Matthias,Saint Matthieu,Saint Paul de Tarse,Saint Philippe,Saint Pierre,Saint Simon,Saint Thomas,Serpent,Sommeil,Songe,Tempête",https://hieronyma.ict-toulouse.fr/files/original/bff57449df5991e37c973feaf349594c.jpg,"Image fixe","Catechisme Royal",1,0
"S. Simon Petrus I Papa Bethsaidensis Galileus",,,,,,,,,,"Image pleine page",latin,"Gravure sur cuivre ; Gravure sur bois",C_2243_005_web,,,,,,,,,,,,,,,,,,,,,,,,,,,,,,,,,,,,"Armoiries,Auréole,Clé,Livre,Portrait,Saint Pierre",https://hieronyma.ict-toulouse.fr/files/original/0cf5f3d4a37ea023b6eb3437c7d4e524.JPG,"Image fixe","Le vite de pontefici",1,0
"[Page de titre avec une vignette représentant l'auteur Matteo D'Afflitto]",,,,,,,,,,Vignette,latin,"Gravure sur bois",RES_16P_008_009_web,,,,,,,,,,,,,,,,,,,,,,,,,,,,,,,,,,,,"Activité intellectuelle,Angelot,Bibliothèque,Décor d'architecture,Élément végétal,Groupe,Intérieur,Lecture,Livre,Lutrin,Matteo D'Afflitto,Putti,Savant,Sciences juridiques,Sirène poisson",https://hieronyma.ict-toulouse.fr/files/original/4af4fea05238cbb57f6d8b882d3d816c.jpg,,"Tractatus de iure prothomiseos sive de iure congrui ",1,0
"[Portrait et signature de Louis XIII]",,,,,,,,,,"Image pleine page",,Enluminure,RES_17G_001_002_web,,,,,,,,,,,,,,,,,,,,,,,,,,,,,,,,,,,,"Agenouillé,Couronne,Fleur de lys,Lecture,Lettre L,Livre,Louis XIII,Phylactère,Portrait,Putti,Sceptre,Tenture",https://hieronyma.ict-toulouse.fr/files/original/987d94d7e34e0f2f1f0948b0ee0a2dd8.JPG,,"Livre des rois",1,0
