﻿"Dublin Core:Title","Dublin Core:Subject","Dublin Core:Description","Dublin Core:Creator","Dublin Core:Source","Dublin Core:Publisher","Dublin Core:Date","Dublin Core:Contributor","Dublin Core:Rights","Dublin Core:Relation","Dublin Core:Format","Dublin Core:Language","Dublin Core:Type","Dublin Core:Identifier","Dublin Core:Coverage","Item Type Metadata:Text","Item Type Metadata:Interviewer","Item Type Metadata:Interviewee","Item Type Metadata:Location","Item Type Metadata:Transcription","Item Type Metadata:Local URL","Item Type Metadata:Original Format","Item Type Metadata:Physical Dimensions","Item Type Metadata:Duration","Item Type Metadata:Compression","Item Type Metadata:Producer","Item Type Metadata:Director","Item Type Metadata:Bit Rate/Frequency","Item Type Metadata:Time Summary","Item Type Metadata:Email Body","Item Type Metadata:Subject Line","Item Type Metadata:From","Item Type Metadata:To","Item Type Metadata:CC","Item Type Metadata:BCC","Item Type Metadata:Number of Attachments","Item Type Metadata:Standards","Item Type Metadata:Objectives","Item Type Metadata:Materials","Item Type Metadata:Lesson Plan Text","Item Type Metadata:URL","Item Type Metadata:Event Type","Item Type Metadata:Participants","Item Type Metadata:Birth Date","Item Type Metadata:Birthplace","Item Type Metadata:Death Date","Item Type Metadata:Occupation","Item Type Metadata:Biographical Text","Item Type Metadata:Bibliography",tags,file,itemType,collection,public,featured
"Defaite des V rois de Sodome de Gomorre, d'Adama, de Seboim, et de Bala",,,,,,,,,,"Image mi-page","français ; latin","Gravure sur cuivre",PAT_18G_001_019_web_b,,,,,,,,,,,,,,,,,,,,,,,,,,,,,,,,,,,,"Bataille,Cavalier,Chute,Défaite,Fuite,Livre de la Genèse,Mort,Roi",https://hieronyma.ict-toulouse.fr/files/original/91f6734a677fbe7735755d3655d8440a.JPG,,"L'Ancien et le Nouveau Testament représentés en cinq cens tableaux gravés d'après les desseins de Raphaël & autres grands maîtres et expliqués par les paroles de l'Ecriture",1,0
"La Vierge couronnée d'étoiles (vision de saint Jean).",,,,,,,,,,Planche,,"Gravure sur acier",1133_SAI_2_108_web,,,,,,,,,,,,,,,,,,,,,,,,,,,,,,,,,,,,"Ange,Apocalypse,Armée,Bataille,Croissant de lune,Dragon,Étoile,Vierge à l'Enfant,Vision",https://hieronyma.ict-toulouse.fr/files/original/0dd58b900469f24da07c78a04d5eee96.JPG,,"La Sainte Bible : traduction nouvelle selon la Vulgate",1,0
"Mort d'Éléazar Machabée.",,,,,,,,,,Planche,,"Gravure sur acier",1133_SAI_2_031_web,,,,,,,,,,,,,,,,,,,,,,,,,,,,,,,,,,,,"Bataille,Éléazar Maccabée,Éléphant,Lance,Mort,Premier Livre des Maccabées",https://hieronyma.ict-toulouse.fr/files/original/0db09c61879ca2d0710a189ced7f95cf.JPG,,"La Sainte Bible : traduction nouvelle selon la Vulgate",1,0
"Plan de la Bataille de Lawfeldt gagnée par le Roy le 2e juillet 1747",,,,,,,,,,Planche,,"Gravure sur cuivre",PAT_18P_179_023_web,,,,,,,,,,,,,,,,,,,,,,,,,,,,,,,,,,,,"Bataille,JEP2019,Plan",https://hieronyma.ict-toulouse.fr/files/original/f103861651b43f09421cc8ec8a6984ed.jpg,"Image fixe","La Henriade. 1787",1,0
"Plan de la bataille de Fontenoy remporté le 11 May 1745 [...]",,,,,,,,,,Planche,,"Gravure sur cuivre",PAT_18P_179_022_web,,,,,,,,,,,,,,,,,,,,,,,,,,,,,,,,,,,,"Bataille,JEP2019,Plan",https://hieronyma.ict-toulouse.fr/files/original/b8ec6a51b35bd94696af54a5b4a6341f.jpg,"Image fixe","La Henriade. 1787",1,0
"[Les Assyriens s'enfuient après la mort d'Holopherne]",,,,,,,,,,Vignette,,"Gravure sur bois",PAT_16M_022_247_web,,,,,,,,,,,,,,,,,,,,,,,,,,,,,,,,,,,,"Armée,Bataille,Holopherne,Livre de Judith,Mort,Poursuite militaire,Rempart,Tente,Tête,Trompe",https://hieronyma.ict-toulouse.fr/files/original/2498375562677dfdd44042c52c5a3a29.JPG,"Image fixe","[Bible, latin, 1574]",1,0
"[Les Ammonites et les Moabites s’entre-tuent]",,,,,,,,,,Vignette,,"Gravure sur bois",PAT_16M_022_232_web,,,,,,,,,,,,,,,,,,,,,,,,,,,,,,,,,,,,"Bataille,Deuxième Livre des Chroniques,Mort par le fer,Pillage,Soldat",https://hieronyma.ict-toulouse.fr/files/original/bebdfedab0afdabc34971df910549b6c.jpg,"Image fixe","[Bible, latin, 1574]",1,0
"[Samuel offre un agneau de lait en holocauste]",,,,,,,,,,"Pleine page",,"Gravure sur bois",PAT_16M_022_153_web,,,,,,,,,,,,,,,,,,,,,,,,,,,,,,,,,,,,"Agneau,Autel,Bataille,Flamme,Premier Livre de Samuel,Sacrifice,Samuel,Victoire",https://hieronyma.ict-toulouse.fr/files/original/1e191e130a56058d2b516f0992819065.JPG,"Image fixe","[Bible, latin, 1574]",1,0
"[Josué arrêtant le soleil et la lune]",,,,,,,,,,"Pleine page",,"Gravure sur bois",PAT_16M_022_129_web,,,,,,,,,,,,,,,,,,,,,,,,,,,,,,,,,,,,"Bataille,Cadavre,Fuite,Josué,Livre de Josué,Lune,Miracle,Soleil,Victoire",https://hieronyma.ict-toulouse.fr/files/original/f6c3ad3c1c4699aaf00c2c972a729f57.JPG,"Image fixe","[Bible, latin, 1574]",1,0
"[Le frappement du rocher. La bataille de Josué contre les Amalécites]",,,,,,,,,,"Pleine page",,"Gravure sur bois",PAT_16M_022_087_web,,,,,,,,,,,,,,,,,,,,,,,,,,,,,,,,,,,,"Aaron,Bataille,Bâton,Boisson,Colline,Livre de l'Exode,Miracle,Moïse,Rocher,Source,Tente,Victoire",https://hieronyma.ict-toulouse.fr/files/original/05baefc16bb91a5197c438932239831a.jpg,"Image fixe","[Bible, latin, 1574]",1,0
